Target
Muscarinic acetylcholine receptor M2
Ligand
BDBM43821
Substrate
Meas. Tech.
Discovery of novel allosteric modulators of the M1 muscarinic receptor: Agonist NMS competition at M2
EC50
28030±n/a nM
Citation
 PubChem, PC Discovery of novel allosteric modulators of the M1 muscarinic receptor: Agonist NMS competition at M2 PubChem Bioassay (2009)[AID] 
Target
Name:
Muscarinic acetylcholine receptor M2
Synonyms:
ACM2_HUMAN Cholinergic, muscarinic M2 Muscarinic acetylcholine receptor M2 and M5 | RecName: Full=Muscarinic acetylcholine receptor M2
Type:
GPCR
Mol. Mass.:
51730.61
Organism:
Homo sapiens (Human)
Description:
P08172
Residue:
466
  
Inhibitor
Name:
BDBM43821
Synonyms:
4-(2-benzamidoethylamino)-1-piperidinecarboxylic acid ethyl ester;hydrochloride CHEMBL1609153 cid_25010774 | ethyl 4-(2-benzamidoethylamino)piperidine-1-carboxylate;hydrochloride
Type:
Small organic molecule
Emp. Form.:
C17H25N3O3
Mol. Mass.:
319.3987
SMILES:
CCOC(=O)N1CCC(CC1)NCCNC(=O)c1ccccc1
: