Target
Muscarinic acetylcholine receptor M2
Ligand
BDBM43819
Substrate
Meas. Tech.
Discovery of novel allosteric modulators of the M1 muscarinic receptor: Agonist NMS competition at M2
Ki
36760±n/a nM
Citation
 PubChem, PC Discovery of novel allosteric modulators of the M1 muscarinic receptor: Agonist NMS competition at M2 PubChem Bioassay (2009)[AID] 
Target
Name:
Muscarinic acetylcholine receptor M2
Synonyms:
ACM2_HUMAN Cholinergic, muscarinic M2 Muscarinic acetylcholine receptor M2 and M5 | RecName: Full=Muscarinic acetylcholine receptor M2
Type:
GPCR
Mol. Mass.:
51730.61
Organism:
Homo sapiens (Human)
Description:
P08172
Residue:
466
  
Inhibitor
Name:
BDBM43819
Synonyms:
4-[2-(2-thenoylamino)ethylamino]piperidine-1-carboxylic acid ethyl ester 4-{2-[(Thiophene-2-carbonyl)-amino]-ethylamino}-piperidine-1-carboxylic acid ethyl ester cid_647412 ethyl 4-[2-(thiophene-2-carbonylamino)ethylamino]piperidine-1-carboxylate
Type:
Small organic molecule
Emp. Form.:
C15H23N3O3S
Mol. Mass.:
325.426
SMILES:
CCOC(=O)N1CCC(CC1)NCCNC(=O)c1cccs1
: