Target
Glutathione S-transferase Mu 1
Ligand
BDBM47581
Substrate
Meas. Tech.
Profiling Assay to determine GST-GSH interactions in multiplex bead-based assays
EC50
13410±n/a nM
Citation
 PubChem, PC Profiling Assay to determine GST-GSH interactions in multiplex bead-based assays PubChem Bioassay (2010)[AID] 
Target
Name:
Glutathione S-transferase Mu 1
Synonyms:
GST class-mu 1 GSTM1 GSTM1_HUMAN GSTM1b-1b Glutathione S-transferase Mu 1 glutathione S-transferase
Type:
PROTEIN
Mol. Mass.:
25712.03
Organism:
Homo sapiens (Human)
Description:
ChEMBL_799596
Residue:
218
  
Inhibitor
Name:
BDBM47581
Synonyms:
(3Z)-3-(1-methyl-5-oxidanylidene-2-sulfanylidene-imidazolidin-4-ylidene)-1H-indol-2-one (3Z)-3-(1-methyl-5-oxo-2-sulfanylideneimidazolidin-4-ylidene)-1H-indol-2-one 3-(1-methyl-5-oxo-2-thioxo-4-imidazolidinylidene)-1,3-dihydro-2H-indol-2-one SMR000198608 | cid_5738220
Type:
Small organic molecule
Emp. Form.:
C12H9N3O2S
Mol. Mass.:
259.284
SMILES:
CN1C(=S)N\C(C1=O)=C1/C(=O)Nc2ccccc12
: