Target
Glutathione S-transferase Mu 1
Ligand
BDBM47585
Substrate
Meas. Tech.
Profiling Assay to determine GST-GSH interactions in multiplex bead-based assays
EC50
682.1±n/a nM
Citation
 PubChem, PC Profiling Assay to determine GST-GSH interactions in multiplex bead-based assays PubChem Bioassay (2010)[AID] 
Target
Name:
Glutathione S-transferase Mu 1
Synonyms:
GST class-mu 1 GSTM1 GSTM1_HUMAN GSTM1b-1b Glutathione S-transferase Mu 1 glutathione S-transferase
Type:
PROTEIN
Mol. Mass.:
25712.03
Organism:
Homo sapiens (Human)
Description:
ChEMBL_799596
Residue:
218
  
Inhibitor
Name:
BDBM47585
Synonyms:
1-(2,1,3-benzothiadiazol-4-yl)-3-[(3,4-dimethoxyphenyl)methylideneamino]urea MLS000566972 cid_1098733
Type:
Small organic molecule
Emp. Form.:
C16H15N5O3S
Mol. Mass.:
357.387
SMILES:
COc1ccc(C=NNC(=O)Nc2cccc3nsnc23)cc1OC
: