Target
Glutathione S-transferase Mu 1
Ligand
BDBM34784
Substrate
Meas. Tech.
Profiling Assay to determine GST-GSH interactions in multiplex bead-based assays
EC50
6987±n/a nM
Citation
 PubChem, PC Profiling Assay to determine GST-GSH interactions in multiplex bead-based assays PubChem Bioassay (2010)[AID] 
Target
Name:
Glutathione S-transferase Mu 1
Synonyms:
GST class-mu 1 GSTM1 GSTM1_HUMAN GSTM1b-1b Glutathione S-transferase Mu 1 glutathione S-transferase
Type:
PROTEIN
Mol. Mass.:
25712.03
Organism:
Homo sapiens (Human)
Description:
ChEMBL_799596
Residue:
218
  
Inhibitor
Name:
BDBM34784
Synonyms:
8-amino-3-cyclohexyl-7-methyl-1H-benzo[g]pteridine-2,4-dione 8-azanyl-3-cyclohexyl-7-methyl-1H-benzo[g]pteridine-2,4-dione SMR000218274 | cid_5419018
Type:
Small organic molecule
Emp. Form.:
C17H19N5O2
Mol. Mass.:
325.3651
SMILES:
Cc1cc2nc3c(nc2cc1N)[nH]c(=O)n(C1CCCCC1)c3=O
: