Target
Glutathione S-transferase Mu 1
Ligand
BDBM47603
Substrate
Meas. Tech.
Profiling Assay to determine GST-GSH interactions in multiplex bead-based assays
EC50
973.7±n/a nM
Citation
 PubChem, PC Profiling Assay to determine GST-GSH interactions in multiplex bead-based assays PubChem Bioassay (2010)[AID] 
Target
Name:
Glutathione S-transferase Mu 1
Synonyms:
GST class-mu 1 GSTM1 GSTM1_HUMAN GSTM1b-1b Glutathione S-transferase Mu 1 glutathione S-transferase
Type:
PROTEIN
Mol. Mass.:
25712.03
Organism:
Homo sapiens (Human)
Description:
ChEMBL_799596
Residue:
218
  
Inhibitor
Name:
BDBM47603
Synonyms:
(5E)-2-(4-hydroxyanilino)-5-(4-hydroxy-3,5-dimethoxy-benzylidene)-2-thiazolin-4-one (5E)-2-(4-hydroxyanilino)-5-[(4-hydroxy-3,5-dimethoxyphenyl)methylidene]-4-thiazolone (5Z)-2-(4-hydroxyanilino)-5-(4-hydroxy-3,5-dimethoxy-benzylidene)-2-thiazolin-4-one SMR000275022 | cid_5768667
Type:
Small organic molecule
Emp. Form.:
C18H16N2O5S
Mol. Mass.:
372.395
SMILES:
COc1cc(C=C2SC(Nc3ccc(O)cc3)=NC2=O)cc(OC)c1O
: