Target
Glutathione S-transferase Mu 1
Ligand
BDBM47606
Substrate
Meas. Tech.
Profiling Assay to determine GST-GSH interactions in multiplex bead-based assays
EC50
9299±n/a nM
Citation
 PubChem, PC Profiling Assay to determine GST-GSH interactions in multiplex bead-based assays PubChem Bioassay (2010)[AID] 
Target
Name:
Glutathione S-transferase Mu 1
Synonyms:
GST class-mu 1 GSTM1 GSTM1_HUMAN GSTM1b-1b Glutathione S-transferase Mu 1 glutathione S-transferase
Type:
PROTEIN
Mol. Mass.:
25712.03
Organism:
Homo sapiens (Human)
Description:
ChEMBL_799596
Residue:
218
  
Inhibitor
Name:
BDBM47606
Synonyms:
3-({[(3-methoxy-2-naphthoyl)amino]carbonothioyl}amino)benzoic acid 3-[(3-methoxynaphthalen-2-yl)carbonylcarbamothioylamino]benzoic acid 3-[[[[(3-methoxy-2-naphthalenyl)-oxomethyl]amino]-sulfanylidenemethyl]amino]benzoic acid SMR000298955 | cid_1327499
Type:
Small organic molecule
Emp. Form.:
C20H16N2O4S
Mol. Mass.:
380.417
SMILES:
COc1cc2ccccc2cc1C(=O)NC(=S)Nc1cccc(c1)C(O)=O
: