Target
Glutathione S-transferase Mu 1
Ligand
BDBM47607
Substrate
Meas. Tech.
Profiling Assay to determine GST-GSH interactions in multiplex bead-based assays
EC50
13360±n/a nM
Citation
 PubChem, PC Profiling Assay to determine GST-GSH interactions in multiplex bead-based assays PubChem Bioassay (2010)[AID] 
Target
Name:
Glutathione S-transferase Mu 1
Synonyms:
GST class-mu 1 GSTM1 GSTM1_HUMAN GSTM1b-1b Glutathione S-transferase Mu 1 glutathione S-transferase
Type:
PROTEIN
Mol. Mass.:
25712.03
Organism:
Homo sapiens (Human)
Description:
ChEMBL_799596
Residue:
218
  
Inhibitor
Name:
BDBM47607
Synonyms:
1,3-bis[(4-ketocyclohexa-2,5-dien-1-ylidene)methylamino]thiourea 1,3-bis[(4-oxo-1-cyclohexa-2,5-dienylidene)methylamino]thiourea MLS000394713 cid_5356282
Type:
Small organic molecule
Emp. Form.:
C15H14N4O2S
Mol. Mass.:
314.362
SMILES:
Oc1ccc(C=NNC(=S)NN=Cc2ccc(O)cc2)cc1
: