Target
Glutathione S-transferase Mu 1
Ligand
BDBM47677
Substrate
Meas. Tech.
Profiling Assay to determine GST-GSH interactions in multiplex bead-based assays
EC50
38060±n/a nM
Citation
 PubChem, PC Profiling Assay to determine GST-GSH interactions in multiplex bead-based assays PubChem Bioassay (2010)[AID] 
Target
Name:
Glutathione S-transferase Mu 1
Synonyms:
GST class-mu 1 GSTM1 GSTM1_HUMAN GSTM1b-1b Glutathione S-transferase Mu 1 glutathione S-transferase
Type:
PROTEIN
Mol. Mass.:
25712.03
Organism:
Homo sapiens (Human)
Description:
ChEMBL_799596
Residue:
218
  
Inhibitor
Name:
BDBM47677
Synonyms:
3-nitro-N-[[phenyl(2-pyridinyl)methylidene]amino]benzamide 3-nitro-N-[[phenyl(pyridin-2-yl)methylidene]amino]benzamide SMR000363516 | cid_2456176
Type:
Small organic molecule
Emp. Form.:
C19H14N4O3
Mol. Mass.:
346.3395
SMILES:
[O-][N+](=O)c1cccc(c1)C(=O)N[N-][C+](c1ccccc1)c1ccccn1
: