Target
Glutathione S-transferase Mu 1
Ligand
BDBM43816
Substrate
Meas. Tech.
Profiling Assay to determine GST-GSH interactions in multiplex bead-based assays
EC50
2382±n/a nM
Citation
 PubChem, PC Profiling Assay to determine GST-GSH interactions in multiplex bead-based assays PubChem Bioassay (2010)[AID] 
Target
Name:
Glutathione S-transferase Mu 1
Synonyms:
GST class-mu 1 GSTM1 GSTM1_HUMAN GSTM1b-1b Glutathione S-transferase Mu 1 glutathione S-transferase
Type:
PROTEIN
Mol. Mass.:
25712.03
Organism:
Homo sapiens (Human)
Description:
ChEMBL_799596
Residue:
218
  
Inhibitor
Name:
BDBM43816
Synonyms:
5'-bromanylspiro[1,2-dihydro-4,1,2-benzoxadiazine-3,3'-1H-indole]-2'-one 5'-bromospiro[1,2-dihydro-4,1,2-benzoxadiazine-3,3'-1H-indole]-2'-one MLS-0258268.0001 | cid_4879298
Type:
Small organic molecule
Emp. Form.:
C14H10BrN3O2
Mol. Mass.:
332.152
SMILES:
Brc1ccc2NC(=O)C3(NNc4ccccc4O3)c2c1
: