Target
Regulator of G-protein signaling 8
Ligand
BDBM43201
Substrate
Meas. Tech.
Dose respone, multiplexed high-throughput screen for small molecule regulators of RGS family protein interactions, specifically RGS8-Galphao.
EC50
7060±n/a nM
Citation
 PubChem, PC Dose respone, multiplexed high-throughput screen for small molecule regulators of RGS family protein interactions, specifically RGS8-Galphao. PubChem Bioassay (2009)[AID] 
Target
Name:
Regulator of G-protein signaling 8
Synonyms:
RGS8 Regulator of G-protein signaling 8 (RGS8)
Type:
Enzyme Catalytic Domain
Mol. Mass.:
20925.80
Organism:
Homo sapiens (Human)
Description:
gi_74355113
Residue:
180
  
Inhibitor
Name:
BDBM43201
Synonyms:
(2Z,4S,6S,12aS)-4-(dimethylamino)-6,10,11,12a-tetrahydroxy-2-[hydroxy-(1-pyrrolidinylmethylamino)methylidene]-6-methyl-4,4a,5,5a-tetrahydrotetracene-1,3,12-trione (2Z,4S,6S,12aS)-4-(dimethylamino)-6,10,11,12a-tetrahydroxy-2-[hydroxy-(pyrrolidinomethylamino)methylene]-6-methyl-4,4a,5,5a-tetrahydrotetracene-1,3,12-trione MLS000028710 SMR000058701 | cid_6420073
Type:
Small organic molecule
Emp. Form.:
C27H33N3O8
Mol. Mass.:
527.5662
SMILES:
CN(C)[C@H]1C2CC3C(C(=O)c4c(O)cccc4[C@@]3(C)O)C(=O)[C@]2(O)C(=O)C(C(=O)NCN2CCCC2)C1=O
: