Target
Regulator of G-protein signaling 8
Ligand
BDBM46646
Substrate
Meas. Tech.
Dose respone, multiplexed high-throughput screen for small molecule regulators of RGS family protein interactions, specifically RGS8-Galphao.
EC50
3680±n/a nM
Citation
 PubChem, PC Dose respone, multiplexed high-throughput screen for small molecule regulators of RGS family protein interactions, specifically RGS8-Galphao. PubChem Bioassay (2009)[AID] 
Target
Name:
Regulator of G-protein signaling 8
Synonyms:
RGS8 Regulator of G-protein signaling 8 (RGS8)
Type:
Enzyme Catalytic Domain
Mol. Mass.:
20925.80
Organism:
Homo sapiens (Human)
Description:
gi_74355113
Residue:
180
  
Inhibitor
Name:
BDBM46646
Synonyms:
2-(5-morpholin-4-ylsulfonyl-2-pyrrolidin-1-yl-phenyl)-1,2-benzothiazol-3-one 2-(5-morpholinosulfonyl-2-pyrrolidino-phenyl)-1,2-benzothiazol-3-one MLS-0069818.0001 | cid_2327938
Type:
Small organic molecule
Emp. Form.:
C21H23N3O4S2
Mol. Mass.:
445.555
SMILES:
O=c1n(sc2ccccc12)-c1cc(ccc1N1CCCC1)S(=O)(=O)N1CCOCC1
: