Target
Regulator of G-protein signaling 8
Ligand
BDBM47728
Substrate
Meas. Tech.
Dose respone, multiplexed high-throughput screen for small molecule regulators of RGS family protein interactions, specifically RGS8-Galphao.
EC50
>30000±n/a nM
Citation
 PubChem, PC Dose respone, multiplexed high-throughput screen for small molecule regulators of RGS family protein interactions, specifically RGS8-Galphao. PubChem Bioassay (2009)[AID] 
Target
Name:
Regulator of G-protein signaling 8
Synonyms:
RGS8 Regulator of G-protein signaling 8 (RGS8)
Type:
Enzyme Catalytic Domain
Mol. Mass.:
20925.80
Organism:
Homo sapiens (Human)
Description:
gi_74355113
Residue:
180
  
Inhibitor
Name:
BDBM47728
Synonyms:
(2E)-3-(2-chloroanilino)-2-(3,3-dimethyl-2,4-dihydroisoquinolin-1-ylidene)-3-keto-propionic acid ethyl ester MLS000579063 cid_2857584 ethyl (2E)-3-[(2-chlorophenyl)amino]-2-(3,3-dimethyl-2,4-dihydroisoquinolin-1-ylidene)-3-oxidanylidene-propanoate | ethyl 3-[(2-chlorophenyl)amino]-2-(3,3-dimethyl-3,4-dihydro-1(2H)-isoquinolinylidene)-3-oxopropanoate
Type:
Small organic molecule
Emp. Form.:
C22H23ClN2O3
Mol. Mass.:
398.883
SMILES:
CCOC(=O)C(C(=O)Nc1ccccc1Cl)C1=NC(C)(C)Cc2ccccc12
: