Target
Regulator of G-protein signaling 8
Ligand
BDBM47736
Substrate
Meas. Tech.
Dose respone, multiplexed high-throughput screen for small molecule regulators of RGS family protein interactions, specifically RGS8-Galphao.
EC50
>30000±n/a nM
Citation
 PubChem, PC Dose respone, multiplexed high-throughput screen for small molecule regulators of RGS family protein interactions, specifically RGS8-Galphao. PubChem Bioassay (2009)[AID] 
Target
Name:
Regulator of G-protein signaling 8
Synonyms:
RGS8 Regulator of G-protein signaling 8 (RGS8)
Type:
Enzyme Catalytic Domain
Mol. Mass.:
20925.80
Organism:
Homo sapiens (Human)
Description:
gi_74355113
Residue:
180
  
Inhibitor
Name:
BDBM47736
Synonyms:
4-(5-Phenyl-4H-[1,2,4]triazol-3-ylazo)-phenol 4-[(5-phenyl-1H-1,2,4-triazol-3-yl)hydrazinylidene]cyclohexa-2,5-dien-1-one MLS000553942 cid_5759288
Type:
Small organic molecule
Emp. Form.:
C14H11N5O
Mol. Mass.:
265.27
SMILES:
Oc1ccc(cc1)N=Nc1nnc([nH]1)-c1ccccc1
: