Target
Regulator of G-protein signaling 8
Ligand
BDBM47773
Substrate
Meas. Tech.
Dose respone, multiplexed high-throughput screen for small molecule regulators of RGS family protein interactions, specifically RGS8-Galphao.
EC50
>30000±n/a nM
Citation
 PubChem, PC Dose respone, multiplexed high-throughput screen for small molecule regulators of RGS family protein interactions, specifically RGS8-Galphao. PubChem Bioassay (2009)[AID] 
Target
Name:
Regulator of G-protein signaling 8
Synonyms:
RGS8 Regulator of G-protein signaling 8 (RGS8)
Type:
Enzyme Catalytic Domain
Mol. Mass.:
20925.80
Organism:
Homo sapiens (Human)
Description:
gi_74355113
Residue:
180
  
Inhibitor
Name:
BDBM47773
Synonyms:
MLS000693809 N-cycloheptyl-4-ethoxybenzenesulfonamide cid_975925
Type:
Small organic molecule
Emp. Form.:
C15H23NO3S
Mol. Mass.:
297.413
SMILES:
CCOc1ccc(cc1)S(=O)(=O)NC1CCCCCC1
: