Target
Regulator of G-protein signaling 8
Ligand
BDBM47782
Substrate
Meas. Tech.
Dose respone, multiplexed high-throughput screen for small molecule regulators of RGS family protein interactions, specifically RGS8-Galphao.
EC50
>30000±n/a nM
Citation
 PubChem, PC Dose respone, multiplexed high-throughput screen for small molecule regulators of RGS family protein interactions, specifically RGS8-Galphao. PubChem Bioassay (2009)[AID] 
Target
Name:
Regulator of G-protein signaling 8
Synonyms:
RGS8 Regulator of G-protein signaling 8 (RGS8)
Type:
Enzyme Catalytic Domain
Mol. Mass.:
20925.80
Organism:
Homo sapiens (Human)
Description:
gi_74355113
Residue:
180
  
Inhibitor
Name:
BDBM47782
Synonyms:
4-(2-methoxyphenyl)-3-phenyl-1H-1,2,4-triazole-5-thione SMR000283119 | cid_863515
Type:
Small organic molecule
Emp. Form.:
C15H13N3OS
Mol. Mass.:
283.348
SMILES:
COc1ccccc1-n1c(n[nH]c1=S)-c1ccccc1
: