Target
Regulator of G-protein signaling 8
Ligand
BDBM47821
Substrate
Meas. Tech.
Dose respone, multiplexed high-throughput screen for small molecule regulators of RGS family protein interactions, specifically RGS8-Galphao.
EC50
>30000±n/a nM
Citation
 PubChem, PC Dose respone, multiplexed high-throughput screen for small molecule regulators of RGS family protein interactions, specifically RGS8-Galphao. PubChem Bioassay (2009)[AID] 
Target
Name:
Regulator of G-protein signaling 8
Synonyms:
RGS8 Regulator of G-protein signaling 8 (RGS8)
Type:
Enzyme Catalytic Domain
Mol. Mass.:
20925.80
Organism:
Homo sapiens (Human)
Description:
gi_74355113
Residue:
180
  
Inhibitor
Name:
BDBM47821
Synonyms:
1,3,5-triazinane-1,3,5-tricarboxylic acid triethyl ester SMR000529034 triethyl 1,3,5-triazinane-1,3,5-tricarboxylate
Type:
Small organic molecule
Emp. Form.:
C12H21N3O6
Mol. Mass.:
303.3116
SMILES:
CCOC(=O)N1CN(CN(C1)C(=O)OCC)C(=O)OCC
: