Target
Regulator of G-protein signaling 7
Ligand
BDBM47708
Substrate
Meas. Tech.
Dose response, multiplexed high-throughput screen for small molecule regulators of RGS family protein interactions, specifically RGS7-Galphao.
EC50
>30000±n/a nM
Citation
 PubChem, PC Dose response, multiplexed high-throughput screen for small molecule regulators of RGS family protein interactions, specifically RGS7-Galphao. PubChem Bioassay (2009)[AID] 
Target
Name:
Regulator of G-protein signaling 7
Synonyms:
RGS7 | RGS7_HUMAN
Type:
Enzyme Catalytic Domain
Mol. Mass.:
57675.72
Organism:
Homo sapiens (Human)
Description:
P49802
Residue:
495
  
Inhibitor
Name:
BDBM47708
Synonyms:
1-(4-chlorobenzyl)sulfonylisonipecotic acid ethyl ester MLS000066348 cid_2228514 ethyl 1-[(4-chlorophenyl)methylsulfonyl]piperidine-4-carboxylate
Type:
Small organic molecule
Emp. Form.:
C15H20ClNO4S
Mol. Mass.:
345.842
SMILES:
CCOC(=O)C1CCN(CC1)S(=O)(=O)Cc1ccc(Cl)cc1
: