Target
Regulator of G-protein signaling 7
Ligand
BDBM47746
Substrate
Meas. Tech.
Dose response, multiplexed high-throughput screen for small molecule regulators of RGS family protein interactions, specifically RGS7-Galphao.
EC50
>30000±n/a nM
Citation
 PubChem, PC Dose response, multiplexed high-throughput screen for small molecule regulators of RGS family protein interactions, specifically RGS7-Galphao. PubChem Bioassay (2009)[AID] 
Target
Name:
Regulator of G-protein signaling 7
Synonyms:
RGS7 | RGS7_HUMAN
Type:
Enzyme Catalytic Domain
Mol. Mass.:
57675.72
Organism:
Homo sapiens (Human)
Description:
P49802
Residue:
495
  
Inhibitor
Name:
BDBM47746
Synonyms:
MLS000374437 N-(3-azanylidene-1H-isoindol-2-yl)-3-morpholin-4-ylsulfonyl-benzamide N-(3-imino-1H-isoindol-2-yl)-3-morpholin-4-ylsulfonylbenzamide cid_5183675
Type:
Small organic molecule
Emp. Form.:
C19H20N4O4S
Mol. Mass.:
400.451
SMILES:
N=C1N(Cc2ccccc12)NC(=O)c1cccc(c1)S(=O)(=O)N1CCOCC1
: