Target
Regulator of G-protein signaling 7
Ligand
BDBM47808
Substrate
Meas. Tech.
Dose response, multiplexed high-throughput screen for small molecule regulators of RGS family protein interactions, specifically RGS7-Galphao.
EC50
>30000±n/a nM
Citation
 PubChem, PC Dose response, multiplexed high-throughput screen for small molecule regulators of RGS family protein interactions, specifically RGS7-Galphao. PubChem Bioassay (2009)[AID] 
Target
Name:
Regulator of G-protein signaling 7
Synonyms:
RGS7 | RGS7_HUMAN
Type:
Enzyme Catalytic Domain
Mol. Mass.:
57675.72
Organism:
Homo sapiens (Human)
Description:
P49802
Residue:
495
  
Inhibitor
Name:
BDBM47808
Synonyms:
2-(3-isoamoxyphenoxy)acetic acid 2-[3-(3-methylbutoxy)phenoxy]ethanoic acid SMR000370546 | cid_2421787
Type:
Small organic molecule
Emp. Form.:
C13H18O4
Mol. Mass.:
238.2796
SMILES:
CC(C)CCOc1cccc(OCC(O)=O)c1
: