Target
Regulator of G-protein signaling 7
Ligand
BDBM34966
Substrate
Meas. Tech.
Dose response, multiplexed high-throughput screen for small molecule regulators of RGS family protein interactions, specifically RGS7-Galphao.
EC50
>30000±n/a nM
Citation
 PubChem, PC Dose response, multiplexed high-throughput screen for small molecule regulators of RGS family protein interactions, specifically RGS7-Galphao. PubChem Bioassay (2009)[AID] 
Target
Name:
Regulator of G-protein signaling 7
Synonyms:
RGS7 | RGS7_HUMAN
Type:
Enzyme Catalytic Domain
Mol. Mass.:
57675.72
Organism:
Homo sapiens (Human)
Description:
P49802
Residue:
495
  
Inhibitor
Name:
BDBM34966
Synonyms:
3-(3-keto-1,2-benzothiazol-2-yl)-N,N-dimethyl-benzenesulfonamide N,N-dimethyl-3-(3-oxidanylidene-1,2-benzothiazol-2-yl)benzenesulfonamide SMR000364449 | cid_5040456
Type:
Small organic molecule
Emp. Form.:
C15H14N2O3S2
Mol. Mass.:
334.413
SMILES:
CN(C)S(=O)(=O)c1cccc(c1)-n1sc2ccccc2c1=O
: