Target
Regulator of G-protein signaling 7
Ligand
BDBM47816
Substrate
Meas. Tech.
Dose response, multiplexed high-throughput screen for small molecule regulators of RGS family protein interactions, specifically RGS7-Galphao.
EC50
1740±n/a nM
Citation
 PubChem, PC Dose response, multiplexed high-throughput screen for small molecule regulators of RGS family protein interactions, specifically RGS7-Galphao. PubChem Bioassay (2009)[AID] 
Target
Name:
Regulator of G-protein signaling 7
Synonyms:
RGS7 | RGS7_HUMAN
Type:
Enzyme Catalytic Domain
Mol. Mass.:
57675.72
Organism:
Homo sapiens (Human)
Description:
P49802
Residue:
495
  
Inhibitor
Name:
BDBM47816
Synonyms:
6-Oxo-6H-anthra[1,9-cd]isoxazole-3-carboxylic acid (3-methoxy-propyl)-amide SMR000425486 | cid_3729555
Type:
Small organic molecule
Emp. Form.:
C19H16N2O4
Mol. Mass.:
336.3413
SMILES:
COCCCNC(=O)c1ccc2C(=O)c3ccccc3-c3onc1c23
: