Target
Regulator of G-protein signaling 19
Ligand
BDBM47700
Substrate
Meas. Tech.
Dose response, multiplexed high-throughput screen for small molecule regulators of RGS family protein interactions, specifically RGS19-Galphao.
EC50
>30000±n/a nM
Citation
 PubChem, PC Dose response, multiplexed high-throughput screen for small molecule regulators of RGS family protein interactions, specifically RGS19-Galphao. PubChem Bioassay (2009)[AID] 
Target
Name:
Regulator of G-protein signaling 19
Synonyms:
G protein signalling regulator 19 GNAI3IP RGS19_HUMAN | Regulator of G-protein signaling 19 (RGS19)
Type:
Enzyme Catalytic Domain
Mol. Mass.:
24631.38
Organism:
Homo sapiens (Human)
Description:
gi_86990435
Residue:
217
  
Inhibitor
Name:
BDBM47700
Synonyms:
2-(4-methyl-1-piperidinyl)aniline MLS000080408 [2-(4-methylpiperidino)phenyl]amine | cid_663698
Type:
Small organic molecule
Emp. Form.:
C12H18N2
Mol. Mass.:
190.2847
SMILES:
CC1CCN(CC1)c1ccccc1N
: