Target
Regulator of G-protein signaling 19
Ligand
BDBM34336
Substrate
Meas. Tech.
Dose response, multiplexed high-throughput screen for small molecule regulators of RGS family protein interactions, specifically RGS19-Galphao.
EC50
120±n/a nM
Citation
 PubChem, PC Dose response, multiplexed high-throughput screen for small molecule regulators of RGS family protein interactions, specifically RGS19-Galphao. PubChem Bioassay (2009)[AID] 
Target
Name:
Regulator of G-protein signaling 19
Synonyms:
G protein signalling regulator 19 GNAI3IP RGS19_HUMAN | Regulator of G-protein signaling 19 (RGS19)
Type:
Enzyme Catalytic Domain
Mol. Mass.:
24631.38
Organism:
Homo sapiens (Human)
Description:
gi_86990435
Residue:
217
  
Inhibitor
Name:
BDBM34336
Synonyms:
2-(2-morpholin-4-yl-5-morpholin-4-ylsulfonyl-phenyl)-1,2-benzothiazol-3-one 2-(2-morpholino-5-morpholinosulfonyl-phenyl)-1,2-benzothiazol-3-one MLS000055722 cid_2325815
Type:
Small organic molecule
Emp. Form.:
C21H23N3O5S2
Mol. Mass.:
461.554
SMILES:
O=c1n(sc2ccccc12)-c1cc(ccc1N1CCOCC1)S(=O)(=O)N1CCOCC1
: