Target
Regulator of G-protein signaling 19
Ligand
BDBM47703
Substrate
Meas. Tech.
Dose response, multiplexed high-throughput screen for small molecule regulators of RGS family protein interactions, specifically RGS19-Galphao.
EC50
>30000±n/a nM
Citation
 PubChem, PC Dose response, multiplexed high-throughput screen for small molecule regulators of RGS family protein interactions, specifically RGS19-Galphao. PubChem Bioassay (2009)[AID] 
Target
Name:
Regulator of G-protein signaling 19
Synonyms:
G protein signalling regulator 19 GNAI3IP RGS19_HUMAN | Regulator of G-protein signaling 19 (RGS19)
Type:
Enzyme Catalytic Domain
Mol. Mass.:
24631.38
Organism:
Homo sapiens (Human)
Description:
gi_86990435
Residue:
217
  
Inhibitor
Name:
BDBM47703
Synonyms:
2,3-dihydro-1,4-dioxin-5-carboxylic acid [2-(4-tert-butylanilino)-2-oxoethyl] ester MLS000082235 [2-(4-tert-butylanilino)-2-oxoethyl] 2,3-dihydro-1,4-dioxine-5-carboxylate cid_2337962
Type:
Small organic molecule
Emp. Form.:
C17H21NO5
Mol. Mass.:
319.3523
SMILES:
CC(C)(C)c1ccc(NC(=O)COC(=O)C2=COCCO2)cc1
: