Target
Regulator of G-protein signaling 19
Ligand
BDBM47723
Substrate
Meas. Tech.
Dose response, multiplexed high-throughput screen for small molecule regulators of RGS family protein interactions, specifically RGS19-Galphao.
EC50
>30000±n/a nM
Citation
 PubChem, PC Dose response, multiplexed high-throughput screen for small molecule regulators of RGS family protein interactions, specifically RGS19-Galphao. PubChem Bioassay (2009)[AID] 
Target
Name:
Regulator of G-protein signaling 19
Synonyms:
G protein signalling regulator 19 GNAI3IP RGS19_HUMAN | Regulator of G-protein signaling 19 (RGS19)
Type:
Enzyme Catalytic Domain
Mol. Mass.:
24631.38
Organism:
Homo sapiens (Human)
Description:
gi_86990435
Residue:
217
  
Inhibitor
Name:
BDBM47723
Synonyms:
(5Z)-1-(2-furanylmethyl)-2-sulfanylidene-5-[(thiophen-2-ylmethylamino)methylidene]-1,3-diazinane-4,6-dione (5Z)-1-(furan-2-ylmethyl)-2-sulfanylidene-5-[(thiophen-2-ylmethylamino)methylidene]-1,3-diazinane-4,6-dione MLS000535170 cid_5415835
Type:
Small organic molecule
Emp. Form.:
C15H13N3O3S2
Mol. Mass.:
347.412
SMILES:
O=C1NC(=S)N(Cc2ccco2)C(=O)C1=CNCc1cccs1
: