Target
Regulator of G-protein signaling 19
Ligand
BDBM47784
Substrate
Meas. Tech.
Dose response, multiplexed high-throughput screen for small molecule regulators of RGS family protein interactions, specifically RGS19-Galphao.
EC50
>30000±n/a nM
Citation
 PubChem, PC Dose response, multiplexed high-throughput screen for small molecule regulators of RGS family protein interactions, specifically RGS19-Galphao. PubChem Bioassay (2009)[AID] 
Target
Name:
Regulator of G-protein signaling 19
Synonyms:
G protein signalling regulator 19 GNAI3IP RGS19_HUMAN | Regulator of G-protein signaling 19 (RGS19)
Type:
Enzyme Catalytic Domain
Mol. Mass.:
24631.38
Organism:
Homo sapiens (Human)
Description:
gi_86990435
Residue:
217
  
Inhibitor
Name:
BDBM47784
Synonyms:
2-[[(2-acetamido-5-bromo-phenyl)-phenyl-methyl]amino]acetic acid methyl ester MLS000692775 cid_2870391 methyl 2-[[(2-acetamido-5-bromophenyl)-phenylmethyl]amino]acetate
Type:
Small organic molecule
Emp. Form.:
C18H19BrN2O3
Mol. Mass.:
391.259
SMILES:
COC(=O)CNC(c1ccccc1)c1cc(Br)ccc1NC(C)=O
: