Target
Regulator of G-protein signaling 19
Ligand
BDBM47801
Substrate
Meas. Tech.
Dose response, multiplexed high-throughput screen for small molecule regulators of RGS family protein interactions, specifically RGS19-Galphao.
EC50
>30000±n/a nM
Citation
 PubChem, PC Dose response, multiplexed high-throughput screen for small molecule regulators of RGS family protein interactions, specifically RGS19-Galphao. PubChem Bioassay (2009)[AID] 
Target
Name:
Regulator of G-protein signaling 19
Synonyms:
G protein signalling regulator 19 GNAI3IP RGS19_HUMAN | Regulator of G-protein signaling 19 (RGS19)
Type:
Enzyme Catalytic Domain
Mol. Mass.:
24631.38
Organism:
Homo sapiens (Human)
Description:
gi_86990435
Residue:
217
  
Inhibitor
Name:
BDBM47801
Synonyms:
4-methoxy-N-(4-pyrrol-1-ylphenyl)benzenesulfonamide 4-methoxy-N-[4-(1H-pyrrol-1-yl)phenyl]benzenesulfonamide SMR000338285 | cid_2768241
Type:
Small organic molecule
Emp. Form.:
C17H16N2O3S
Mol. Mass.:
328.386
SMILES:
COc1ccc(cc1)S(=O)(=O)Nc1ccc(cc1)-n1cccc1
: