Target
Regulator of G-protein signaling 19
Ligand
BDBM47813
Substrate
Meas. Tech.
Dose response, multiplexed high-throughput screen for small molecule regulators of RGS family protein interactions, specifically RGS19-Galphao.
EC50
>30000±n/a nM
Citation
 PubChem, PC Dose response, multiplexed high-throughput screen for small molecule regulators of RGS family protein interactions, specifically RGS19-Galphao. PubChem Bioassay (2009)[AID] 
Target
Name:
Regulator of G-protein signaling 19
Synonyms:
G protein signalling regulator 19 GNAI3IP RGS19_HUMAN | Regulator of G-protein signaling 19 (RGS19)
Type:
Enzyme Catalytic Domain
Mol. Mass.:
24631.38
Organism:
Homo sapiens (Human)
Description:
gi_86990435
Residue:
217
  
Inhibitor
Name:
BDBM47813
Synonyms:
(3R)-2-(4-fluorophenyl)sulfonyl-3,4-dihydro-1H-isoquinoline-3-carboxylic acid MLS000777226 cid_705446
Type:
Small organic molecule
Emp. Form.:
C16H14FNO4S
Mol. Mass.:
335.35
SMILES:
OC(=O)[C@H]1Cc2ccccc2CN1S(=O)(=O)c1ccc(F)cc1
: