Target
Regulator of G-protein signaling 19
Ligand
BDBM47818
Substrate
Meas. Tech.
Dose response, multiplexed high-throughput screen for small molecule regulators of RGS family protein interactions, specifically RGS19-Galphao.
EC50
7640±n/a nM
Citation
 PubChem, PC Dose response, multiplexed high-throughput screen for small molecule regulators of RGS family protein interactions, specifically RGS19-Galphao. PubChem Bioassay (2009)[AID] 
Target
Name:
Regulator of G-protein signaling 19
Synonyms:
G protein signalling regulator 19 GNAI3IP RGS19_HUMAN | Regulator of G-protein signaling 19 (RGS19)
Type:
Enzyme Catalytic Domain
Mol. Mass.:
24631.38
Organism:
Homo sapiens (Human)
Description:
gi_86990435
Residue:
217
  
Inhibitor
Name:
BDBM47818
Synonyms:
1-[3-(4-nitrophenyl)-5,6-dihydroimidazo[2,1-b][1,3]thiazol-7-ium-7-yl]ethanone;bromide 7-Acetyl-3-(4-nitro-phenyl)-6,7-dihydro-5H-imidazo[2,1-b]thiazol-4-ylium SMR000425022 | cid_16682047
Type:
Small organic molecule
Emp. Form.:
C13H12N3O3S
Mol. Mass.:
290.317
SMILES:
CC(=O)N1CC[n+]2c1scc2-c1ccc(cc1)[N+]([O-])=O
: