Target
Regulator of G-protein signaling 19
Ligand
BDBM25469
Substrate
Meas. Tech.
Dose response, multiplexed high-throughput screen for small molecule regulators of RGS family protein interactions, specifically RGS19-Galphao.
EC50
880±n/a nM
Citation
 PubChem, PC Dose response, multiplexed high-throughput screen for small molecule regulators of RGS family protein interactions, specifically RGS19-Galphao. PubChem Bioassay (2009)[AID] 
Target
Name:
Regulator of G-protein signaling 19
Synonyms:
G protein signalling regulator 19 GNAI3IP RGS19_HUMAN | Regulator of G-protein signaling 19 (RGS19)
Type:
Enzyme Catalytic Domain
Mol. Mass.:
24631.38
Organism:
Homo sapiens (Human)
Description:
gi_86990435
Residue:
217
  
Inhibitor
Name:
BDBM25469
Synonyms:
2-[(7-nitro-2,1,3-benzoxadiazol-4-yl)sulfanyl]-1-oxidopyridin-1-ium cid_313619
Type:
Small organic molecule
Emp. Form.:
C11H6N4O4S
Mol. Mass.:
290.255
SMILES:
[O-][N+](=O)c1ccc(Sc2cccc[n+]2[O-])c2nonc12
: