Target
Regulator of G-protein signaling 19
Ligand
BDBM47830
Substrate
Meas. Tech.
Dose response, multiplexed high-throughput screen for small molecule regulators of RGS family protein interactions, specifically RGS19-Galphao.
EC50
>30000±n/a nM
Citation
 PubChem, PC Dose response, multiplexed high-throughput screen for small molecule regulators of RGS family protein interactions, specifically RGS19-Galphao. PubChem Bioassay (2009)[AID] 
Target
Name:
Regulator of G-protein signaling 19
Synonyms:
G protein signalling regulator 19 GNAI3IP RGS19_HUMAN | Regulator of G-protein signaling 19 (RGS19)
Type:
Enzyme Catalytic Domain
Mol. Mass.:
24631.38
Organism:
Homo sapiens (Human)
Description:
gi_86990435
Residue:
217
  
Inhibitor
Name:
BDBM47830
Synonyms:
4-cyclopropyl-6-(methylthio)-1,3,5-triazin-2-amine MLS000861275 [4-cyclopropyl-6-(methylthio)-s-triazin-2-yl]amine | cid_602660
Type:
Small organic molecule
Emp. Form.:
C7H10N4S
Mol. Mass.:
182.246
SMILES:
CSc1nc(N)nc(n1)C1CC1
: