Target
Regulator of G-protein signaling 19
Ligand
BDBM47836
Substrate
Meas. Tech.
Dose response, multiplexed high-throughput screen for small molecule regulators of RGS family protein interactions, specifically RGS19-Galphao.
EC50
>30000±n/a nM
Citation
 PubChem, PC Dose response, multiplexed high-throughput screen for small molecule regulators of RGS family protein interactions, specifically RGS19-Galphao. PubChem Bioassay (2009)[AID] 
Target
Name:
Regulator of G-protein signaling 19
Synonyms:
G protein signalling regulator 19 GNAI3IP RGS19_HUMAN | Regulator of G-protein signaling 19 (RGS19)
Type:
Enzyme Catalytic Domain
Mol. Mass.:
24631.38
Organism:
Homo sapiens (Human)
Description:
gi_86990435
Residue:
217
  
Inhibitor
Name:
BDBM47836
Synonyms:
1-N,4-N-bis[3-(1H-benzimidazol-2-yl)phenyl]benzene-1,4-dicarboxamide N,N'-bis[3-(1H-benzimidazol-2-yl)phenyl]terephthalamide SMR000528839 | cid_247228
Type:
Small organic molecule
Emp. Form.:
C34H24N6O2
Mol. Mass.:
548.5934
SMILES:
O=C(Nc1cccc(c1)-c1nc2ccccc2[nH]1)c1ccc(cc1)C(=O)Nc1cccc(c1)-c1nc2ccccc2[nH]1
: