Target
Regulator of G-protein signaling 16
Ligand
BDBM47732
Substrate
Meas. Tech.
Dose respone, multiplexed high-throughput screen for small molecule regulators of RGS family protein interactions, specifically RGS16-Galphao.
EC50
14000±n/a nM
Citation
 PubChem, PC Dose respone, multiplexed high-throughput screen for small molecule regulators of RGS family protein interactions, specifically RGS16-Galphao. PubChem Bioassay (2009)[AID] 
Target
Name:
Regulator of G-protein signaling 16
Synonyms:
RGS16 RGSR regulator of G-protein signalling 16
Type:
Enzyme Catalytic Domain
Mol. Mass.:
22748.87
Organism:
Homo sapiens (Human)
Description:
gi_156416009
Residue:
202
  
Inhibitor
Name:
BDBM47732
Synonyms:
2,6,7-trihydroxy-9-o-phenetyl-fluorone 9-(2-ethoxyphenyl)-2,6,7-trihydroxy-3H-xanthen-3-one 9-(2-ethoxyphenyl)-2,6,7-tris(oxidanyl)xanthen-3-one SMR000197680 | cid_2931388
Type:
Small organic molecule
Emp. Form.:
C21H16O6
Mol. Mass.:
364.3481
SMILES:
CCOc1ccccc1-c1c2cc(O)c(O)cc2oc2cc(=O)c(O)cc12
: