Target
Regulator of G-protein signaling 16
Ligand
BDBM47734
Substrate
Meas. Tech.
Dose respone, multiplexed high-throughput screen for small molecule regulators of RGS family protein interactions, specifically RGS16-Galphao.
EC50
11670±n/a nM
Citation
 PubChem, PC Dose respone, multiplexed high-throughput screen for small molecule regulators of RGS family protein interactions, specifically RGS16-Galphao. PubChem Bioassay (2009)[AID] 
Target
Name:
Regulator of G-protein signaling 16
Synonyms:
RGS16 RGSR regulator of G-protein signalling 16
Type:
Enzyme Catalytic Domain
Mol. Mass.:
22748.87
Organism:
Homo sapiens (Human)
Description:
gi_156416009
Residue:
202
  
Inhibitor
Name:
BDBM47734
Synonyms:
MLS000553854 N-[(8-Hydroxy-5-nitro-quinolin-7-yl)-p-tolyl-methyl]-propionamide N-[(8-hydroxy-5-nitro-7-quinolyl)-(p-tolyl)methyl]propionamide SMR000172089 | cid_2922056
Type:
Small organic molecule
Emp. Form.:
C20H19N3O4
Mol. Mass.:
365.3826
SMILES:
CCC(=O)NC(c1ccc(C)cc1)c1cc([N+]([O-])=O)c2cccnc2c1O
: