Target
Regulator of G-protein signaling 16
Ligand
BDBM47737
Substrate
Meas. Tech.
Dose respone, multiplexed high-throughput screen for small molecule regulators of RGS family protein interactions, specifically RGS16-Galphao.
EC50
>30000±n/a nM
Citation
 PubChem, PC Dose respone, multiplexed high-throughput screen for small molecule regulators of RGS family protein interactions, specifically RGS16-Galphao. PubChem Bioassay (2009)[AID] 
Target
Name:
Regulator of G-protein signaling 16
Synonyms:
RGS16 RGSR regulator of G-protein signalling 16
Type:
Enzyme Catalytic Domain
Mol. Mass.:
22748.87
Organism:
Homo sapiens (Human)
Description:
gi_156416009
Residue:
202
  
Inhibitor
Name:
BDBM47737
Synonyms:
3-methyl-4-(4-methylphenyl)-1H-1,2,4-triazole-5-thione 5-Methyl-4-p-tolyl-4H-[1,2,4]triazole-3-thiol SMR000177563 | cid_2950756
Type:
Small organic molecule
Emp. Form.:
C10H11N3S
Mol. Mass.:
205.279
SMILES:
Cc1n[nH]c(=S)n1-c1ccc(C)cc1
: