Target
Regulator of G-protein signaling 16
Ligand
BDBM47746
Substrate
Meas. Tech.
Dose respone, multiplexed high-throughput screen for small molecule regulators of RGS family protein interactions, specifically RGS16-Galphao.
EC50
>30000±n/a nM
Citation
 PubChem, PC Dose respone, multiplexed high-throughput screen for small molecule regulators of RGS family protein interactions, specifically RGS16-Galphao. PubChem Bioassay (2009)[AID] 
Target
Name:
Regulator of G-protein signaling 16
Synonyms:
RGS16 RGSR regulator of G-protein signalling 16
Type:
Enzyme Catalytic Domain
Mol. Mass.:
22748.87
Organism:
Homo sapiens (Human)
Description:
gi_156416009
Residue:
202
  
Inhibitor
Name:
BDBM47746
Synonyms:
MLS000374437 N-(3-azanylidene-1H-isoindol-2-yl)-3-morpholin-4-ylsulfonyl-benzamide N-(3-imino-1H-isoindol-2-yl)-3-morpholin-4-ylsulfonylbenzamide cid_5183675
Type:
Small organic molecule
Emp. Form.:
C19H20N4O4S
Mol. Mass.:
400.451
SMILES:
N=C1N(Cc2ccccc12)NC(=O)c1cccc(c1)S(=O)(=O)N1CCOCC1
: