Target
Regulator of G-protein signaling 16
Ligand
BDBM47750
Substrate
Meas. Tech.
Dose respone, multiplexed high-throughput screen for small molecule regulators of RGS family protein interactions, specifically RGS16-Galphao.
EC50
>30000±n/a nM
Citation
 PubChem, PC Dose respone, multiplexed high-throughput screen for small molecule regulators of RGS family protein interactions, specifically RGS16-Galphao. PubChem Bioassay (2009)[AID] 
Target
Name:
Regulator of G-protein signaling 16
Synonyms:
RGS16 RGSR regulator of G-protein signalling 16
Type:
Enzyme Catalytic Domain
Mol. Mass.:
22748.87
Organism:
Homo sapiens (Human)
Description:
gi_156416009
Residue:
202
  
Inhibitor
Name:
BDBM47750
Synonyms:
4-[(6-nitro-1,3-benzodioxol-5-yl)methyleneamino]-3-(2-pyridyl)-1H-1,2,4-triazole-5-thione 4-[(6-nitro-1,3-benzodioxol-5-yl)methylideneamino]-3-pyridin-2-yl-1H-1,2,4-triazole-5-thione SMR000255795 | cid_2453423
Type:
Small organic molecule
Emp. Form.:
C15H10N6O4S
Mol. Mass.:
370.343
SMILES:
[O-][N+](=O)c1cc2OCOc2cc1[CH+][N-]n1c(n[nH]c1=S)-c1ccccn1
: