Target
Regulator of G-protein signaling 16
Ligand
BDBM47764
Substrate
Meas. Tech.
Dose respone, multiplexed high-throughput screen for small molecule regulators of RGS family protein interactions, specifically RGS16-Galphao.
EC50
8790±n/a nM
Citation
 PubChem, PC Dose respone, multiplexed high-throughput screen for small molecule regulators of RGS family protein interactions, specifically RGS16-Galphao. PubChem Bioassay (2009)[AID] 
Target
Name:
Regulator of G-protein signaling 16
Synonyms:
RGS16 RGSR regulator of G-protein signalling 16
Type:
Enzyme Catalytic Domain
Mol. Mass.:
22748.87
Organism:
Homo sapiens (Human)
Description:
gi_156416009
Residue:
202
  
Inhibitor
Name:
BDBM47764
Synonyms:
(4E)-5-methyl-4-[[3-[[(Z)-(3-methyl-1-phenyl-5-sulfanylidene-4-pyrazolylidene)methyl]amino]propylamino]methylidene]-2-phenyl-3-pyrazolethione (4E)-5-methyl-4-[[3-[[(Z)-(3-methyl-1-phenyl-5-sulfanylidenepyrazol-4-ylidene)methyl]amino]propylamino]methylidene]-2-phenylpyrazole-3-thione 3-methyl-4-{[(3-{[(3-methyl-1-phenyl-5-sulfanyl-1H-pyrazol-4-yl)methylene]amino}propyl)imino]methyl}-1-phenyl-1H-pyrazole-5-thiol SMR000225437 | cid_5581000
Type:
Small organic molecule
Emp. Form.:
C25H26N6S2
Mol. Mass.:
474.644
SMILES:
Cc1[nH]n(-c2ccccc2)c(=S)c1C=NCCCN=Cc1c(C)[nH]n(-c2ccccc2)c1=S
: