Target
Regulator of G-protein signaling 16
Ligand
BDBM34849
Substrate
Meas. Tech.
Dose respone, multiplexed high-throughput screen for small molecule regulators of RGS family protein interactions, specifically RGS16-Galphao.
EC50
16000±n/a nM
Citation
 PubChem, PC Dose respone, multiplexed high-throughput screen for small molecule regulators of RGS family protein interactions, specifically RGS16-Galphao. PubChem Bioassay (2009)[AID] 
Target
Name:
Regulator of G-protein signaling 16
Synonyms:
RGS16 RGSR regulator of G-protein signalling 16
Type:
Enzyme Catalytic Domain
Mol. Mass.:
22748.87
Organism:
Homo sapiens (Human)
Description:
gi_156416009
Residue:
202
  
Inhibitor
Name:
BDBM34849
Synonyms:
6-fluoranyl-2-(2-methylphenyl)-1,2-benzothiazol-3-one 6-fluoro-2-(2-methylphenyl)-1,2-benzothiazol-3-one MLS000729299 cid_1510379
Type:
Small organic molecule
Emp. Form.:
C14H10FNOS
Mol. Mass.:
259.299
SMILES:
Cc1ccccc1-n1sc2cc(F)ccc2c1=O
: