Target
Regulator of G-protein signaling 16
Ligand
BDBM47786
Substrate
Meas. Tech.
Dose respone, multiplexed high-throughput screen for small molecule regulators of RGS family protein interactions, specifically RGS16-Galphao.
EC50
>30000±n/a nM
Citation
 PubChem, PC Dose respone, multiplexed high-throughput screen for small molecule regulators of RGS family protein interactions, specifically RGS16-Galphao. PubChem Bioassay (2009)[AID] 
Target
Name:
Regulator of G-protein signaling 16
Synonyms:
RGS16 RGSR regulator of G-protein signalling 16
Type:
Enzyme Catalytic Domain
Mol. Mass.:
22748.87
Organism:
Homo sapiens (Human)
Description:
gi_156416009
Residue:
202
  
Inhibitor
Name:
BDBM47786
Synonyms:
6-chloro-3-pyridinecarboxylic acid [2-(tert-butylamino)-2-oxoethyl] ester MLS000709523 [2-(tert-butylamino)-2-oxidanylidene-ethyl] 6-chloranylpyridine-3-carboxylate cid_2432404
Type:
Small organic molecule
Emp. Form.:
C12H15ClN2O3
Mol. Mass.:
270.712
SMILES:
CC(C)(C)NC(=O)COC(=O)c1ccc(Cl)nc1
: