Target
Regulator of G-protein signaling 16
Ligand
BDBM47801
Substrate
Meas. Tech.
Dose respone, multiplexed high-throughput screen for small molecule regulators of RGS family protein interactions, specifically RGS16-Galphao.
EC50
>30000±n/a nM
Citation
 PubChem, PC Dose respone, multiplexed high-throughput screen for small molecule regulators of RGS family protein interactions, specifically RGS16-Galphao. PubChem Bioassay (2009)[AID] 
Target
Name:
Regulator of G-protein signaling 16
Synonyms:
RGS16 RGSR regulator of G-protein signalling 16
Type:
Enzyme Catalytic Domain
Mol. Mass.:
22748.87
Organism:
Homo sapiens (Human)
Description:
gi_156416009
Residue:
202
  
Inhibitor
Name:
BDBM47801
Synonyms:
4-methoxy-N-(4-pyrrol-1-ylphenyl)benzenesulfonamide 4-methoxy-N-[4-(1H-pyrrol-1-yl)phenyl]benzenesulfonamide SMR000338285 | cid_2768241
Type:
Small organic molecule
Emp. Form.:
C17H16N2O3S
Mol. Mass.:
328.386
SMILES:
COc1ccc(cc1)S(=O)(=O)Nc1ccc(cc1)-n1cccc1
: