Target
Regulator of G-protein signaling 16
Ligand
BDBM47808
Substrate
Meas. Tech.
Dose respone, multiplexed high-throughput screen for small molecule regulators of RGS family protein interactions, specifically RGS16-Galphao.
EC50
>30000±n/a nM
Citation
 PubChem, PC Dose respone, multiplexed high-throughput screen for small molecule regulators of RGS family protein interactions, specifically RGS16-Galphao. PubChem Bioassay (2009)[AID] 
Target
Name:
Regulator of G-protein signaling 16
Synonyms:
RGS16 RGSR regulator of G-protein signalling 16
Type:
Enzyme Catalytic Domain
Mol. Mass.:
22748.87
Organism:
Homo sapiens (Human)
Description:
gi_156416009
Residue:
202
  
Inhibitor
Name:
BDBM47808
Synonyms:
2-(3-isoamoxyphenoxy)acetic acid 2-[3-(3-methylbutoxy)phenoxy]ethanoic acid SMR000370546 | cid_2421787
Type:
Small organic molecule
Emp. Form.:
C13H18O4
Mol. Mass.:
238.2796
SMILES:
CC(C)CCOc1cccc(OCC(O)=O)c1
: