Target
Regulator of G-protein signaling 16
Ligand
BDBM47825
Substrate
Meas. Tech.
Dose respone, multiplexed high-throughput screen for small molecule regulators of RGS family protein interactions, specifically RGS16-Galphao.
EC50
>30000±n/a nM
Citation
 PubChem, PC Dose respone, multiplexed high-throughput screen for small molecule regulators of RGS family protein interactions, specifically RGS16-Galphao. PubChem Bioassay (2009)[AID] 
Target
Name:
Regulator of G-protein signaling 16
Synonyms:
RGS16 RGSR regulator of G-protein signalling 16
Type:
Enzyme Catalytic Domain
Mol. Mass.:
22748.87
Organism:
Homo sapiens (Human)
Description:
gi_156416009
Residue:
202
  
Inhibitor
Name:
BDBM47825
Synonyms:
MLS000780308 N-[(E)-N'-(5-nitro-1,3-benzoxazol-2-yl)amidino]acetamide N-[(E)-N'-(5-nitro-1,3-benzoxazol-2-yl)carbamimidoyl]ethanamide SMR000420491 | cid_16411063
Type:
Small organic molecule
Emp. Form.:
C10H9N5O4
Mol. Mass.:
263.2096
SMILES:
CC(=O)[NH+]=C(N)[N-]c1nc2cc(ccc2o1)[N+]([O-])=O
: