Target
Regulator of G-protein signaling 16
Ligand
BDBM47829
Substrate
Meas. Tech.
Dose respone, multiplexed high-throughput screen for small molecule regulators of RGS family protein interactions, specifically RGS16-Galphao.
EC50
>30000±n/a nM
Citation
 PubChem, PC Dose respone, multiplexed high-throughput screen for small molecule regulators of RGS family protein interactions, specifically RGS16-Galphao. PubChem Bioassay (2009)[AID] 
Target
Name:
Regulator of G-protein signaling 16
Synonyms:
RGS16 RGSR regulator of G-protein signalling 16
Type:
Enzyme Catalytic Domain
Mol. Mass.:
22748.87
Organism:
Homo sapiens (Human)
Description:
gi_156416009
Residue:
202
  
Inhibitor
Name:
BDBM47829
Synonyms:
(5Z)-5-[ethoxy(hydroxy)methylene]-2-[3-(trifluoromethyl)phenyl]-2-thiazolin-4-one (5Z)-5-[ethoxy(hydroxy)methylidene]-2-[3-(trifluoromethyl)phenyl]-4-thiazolone MLS000851000 cid_5922688 | ethyl 4-hydroxy-2-[3-(trifluoromethyl)phenyl]-1,3-thiazole-5-carboxylate
Type:
Small organic molecule
Emp. Form.:
C13H10F3NO3S
Mol. Mass.:
317.284
SMILES:
CCOC(=O)c1sc(nc1O)-c1cccc(c1)C(F)(F)F
: