Target
3C-like protease
Ligand
BDBM47848
Substrate
Meas. Tech.
QFRET-based dose response biochemical high throughput screening assay to identify inhibitors of the SARS coronavirus 3C-like Protease (3CLPro)
IC50
4834±n/a nM
Citation
 PubChem, PC QFRET-based dose response biochemical high throughput screening assay to identify inhibitors of the SARS coronavirus 3C-like Protease (3CLPro) PubChem Bioassay (2009)[AID] 
Target
Name:
3C-like protease
Synonyms:
Type:
Enzyme Catalytic Domain
Mol. Mass.:
33462.05
Organism:
Avian infectious bronchitis virus
Description:
gi_73745819
Residue:
307
  
Inhibitor
Name:
BDBM47848
Synonyms:
4-[4-(2,3,5,6-tetramethylphenyl)sulfonylpiperazin-1-yl]carbonyl-1H-quinolin-2-one 4-[4-(2,3,5,6-tetramethylphenyl)sulfonylpiperazine-1-carbonyl]carbostyril CVD-0002708 MLS000565635 cid_2417657
Type:
Small organic molecule
Emp. Form.:
C24H27N3O4S
Mol. Mass.:
453.554
SMILES:
Cc1cc(C)c(C)c(c1C)S(=O)(=O)N1CCN(CC1)C(=O)c1cc(=O)[nH]c2ccccc12
: