Target
3C-like protease
Ligand
BDBM32909
Substrate
Meas. Tech.
QFRET-based dose response biochemical high throughput screening assay to identify inhibitors of the SARS coronavirus 3C-like Protease (3CLPro)
IC50
3341±n/a nM
Citation
 PubChem, PC QFRET-based dose response biochemical high throughput screening assay to identify inhibitors of the SARS coronavirus 3C-like Protease (3CLPro) PubChem Bioassay (2009)[AID] 
Target
Name:
3C-like protease
Synonyms:
Type:
Enzyme Catalytic Domain
Mol. Mass.:
33462.05
Organism:
Avian infectious bronchitis virus
Description:
gi_73745819
Residue:
307
  
Inhibitor
Name:
BDBM32909
Synonyms:
(4-methyl-2-oxidanylidene-chromen-7-yl) furan-2-carboxylate 2-furancarboxylic acid (4-methyl-2-oxo-1-benzopyran-7-yl) ester SMR000282525 cid_728528 | furan-2-carboxylic acid (2-keto-4-methyl-chromen-7-yl) ester
Type:
Small organic molecule
Emp. Form.:
C15H10O5
Mol. Mass.:
270.2369
SMILES:
Cc1cc(=O)oc2cc(OC(=O)c3ccco3)ccc12
: