Target
3C-like protease
Ligand
BDBM47866
Substrate
Meas. Tech.
QFRET-based dose response biochemical high throughput screening assay to identify inhibitors of the SARS coronavirus 3C-like Protease (3CLPro)
IC50
7214±n/a nM
Citation
 PubChem, PC QFRET-based dose response biochemical high throughput screening assay to identify inhibitors of the SARS coronavirus 3C-like Protease (3CLPro) PubChem Bioassay (2009)[AID] 
Target
Name:
3C-like protease
Synonyms:
Type:
Enzyme Catalytic Domain
Mol. Mass.:
33462.05
Organism:
Avian infectious bronchitis virus
Description:
gi_73745819
Residue:
307
  
Inhibitor
Name:
BDBM47866
Synonyms:
1-(phenylmethyl)-3-(3-pyridinyl)-4-pyrazolecarboxaldehyde 1-benzyl-3-(3-pyridyl)pyrazole-4-carbaldehyde MLS000772304 cid_2497380
Type:
Small organic molecule
Emp. Form.:
C16H13N3O
Mol. Mass.:
263.2939
SMILES:
O=Cc1cn(Cc2ccccc2)nc1-c1cccnc1
: