Target
3C-like protease
Ligand
BDBM47890
Substrate
Meas. Tech.
QFRET-based dose response biochemical high throughput screening assay to identify inhibitors of the SARS coronavirus 3C-like Protease (3CLPro)
IC50
6563±n/a nM
Citation
 PubChem, PC QFRET-based dose response biochemical high throughput screening assay to identify inhibitors of the SARS coronavirus 3C-like Protease (3CLPro) PubChem Bioassay (2009)[AID] 
Target
Name:
3C-like protease
Synonyms:
Type:
Enzyme Catalytic Domain
Mol. Mass.:
33462.05
Organism:
Avian infectious bronchitis virus
Description:
gi_73745819
Residue:
307
  
Inhibitor
Name:
BDBM47890
Synonyms:
MLS001215951 N-[5-ethyl-1-(2-morpholin-4-ylethyl)-2-oxo-3H-indol-3-yl]acetamide;hydrochloride N-[5-ethyl-2-keto-1-(2-morpholinoethyl)indolin-3-yl]acetamide;hydrochloride cid_24747373
Type:
Small organic molecule
Emp. Form.:
C18H25N3O3
Mol. Mass.:
331.4094
SMILES:
CCc1ccc2N(CCN3CCOCC3)C(=O)C(NC(C)=O)c2c1
: