Target
3C-like protease
Ligand
BDBM47892
Substrate
Meas. Tech.
QFRET-based dose response biochemical high throughput screening assay to identify inhibitors of the SARS coronavirus 3C-like Protease (3CLPro)
IC50
7582±n/a nM
Citation
 PubChem, PC QFRET-based dose response biochemical high throughput screening assay to identify inhibitors of the SARS coronavirus 3C-like Protease (3CLPro) PubChem Bioassay (2009)[AID] 
Target
Name:
3C-like protease
Synonyms:
Type:
Enzyme Catalytic Domain
Mol. Mass.:
33462.05
Organism:
Avian infectious bronchitis virus
Description:
gi_73745819
Residue:
307
  
Inhibitor
Name:
BDBM47892
Synonyms:
MLS001215987 N-[5-bromo-1-(2-morpholin-4-ylethyl)-2-oxo-3H-indol-3-yl]acetamide;hydrochloride N-[5-bromo-2-keto-1-(2-morpholinoethyl)indolin-3-yl]acetamide;hydrochloride cid_24747455
Type:
Small organic molecule
Emp. Form.:
C16H20BrN3O3
Mol. Mass.:
382.252
SMILES:
CC(=O)NC1C(=O)N(CCN2CCOCC2)c2ccc(Br)cc12
: